We're updating the issue view to help you get more done. 

WebLogic unit tests fail on Windows OS

Description

Unit tests fail due to windows slashes:

------------------------------------------------------------------------------- Test set: org.codehaus.cargo.container.weblogic.WebLogicCopyingInstalledLocalDeployerTest
------------------------------------------------------------------------------- Tests run: 1, Failures: 1, Errors: 0, Skipped: 0, Time elapsed: 0.235 sec <<< FAILURE!
testDeployableDirIsAutoDeploy(org.codehaus.cargo.container.weblogic.WebLogicCopyingInstalledLocalDeployerTest) Time elapsed: 0.187 sec <<< FAILURE!
junit.framework.ComparisonFailure: expected:<.../bea/mydomain/...> but was:<...\bea\mydomain\...>
at junit.framework.Assert.assertEquals(Assert.java:81)
at junit.framework.Assert.assertEquals(Assert.java:87)
at org.codehaus.cargo.container.weblogic.WebLogicCopyingInstalledLocalDeployerTest.testDeployableDirIsAutoDeploy(WebLogicCopyingInstalledLocalDeployerTest.java:83)

------------------------------------------------------------------------------- Test set: org.codehaus.cargo.container.weblogic.internal.WebLogicInstalledLocalContainerTest
------------------------------------------------------------------------------- Tests run: 8, Failures: 1, Errors: 0, Skipped: 0, Time elapsed: 0.25 sec <<< FAILURE!
testInitBeaHome(org.codehaus.cargo.container.weblogic.internal.WebLogicInstalledLocalContainerTest) Time elapsed: 0.032 sec <<< FAILURE!
junit.framework.ComparisonFailure: expected:<.../...> but was:<...\...>
at junit.framework.Assert.assertEquals(Assert.java:81)
at junit.framework.Assert.assertEquals(Assert.java:87)
at org.codehaus.cargo.container.weblogic.internal.WebLogicInstalledLocalContainerTest.testInitBeaHome(WebLogicInstalledLocalContainerTest.java:81)

0

Status

Assignee

Adrian Cole

Reporter

Adrian Cole

Components

Fix versions

Affects versions

1.0

Priority

Trivial