We're updating the issue view to help you get more done. 

build broken

Description

[INFO] Compiling 90 source files to C:\Prototype\Mavenized\Product\cargo\core\api\module\targe
t\classes
[INFO] [resources:testResources]
[INFO] Using default encoding to copy filtered resources.
[INFO] [compiler:testCompile]
[INFO] Not compiling test sources
[INFO] [surefire:test]
[INFO] Tests are skipped.
[INFO] [jar:jar]
[INFO] Building jar: C:\Prototype\Mavenized\Product\cargo\core\api\module\target\cargo-core-ap
i-module-1.0-SNAPSHOT.jar
[INFO] Preparing clirr:check
[WARNING] Removing: check from forked lifecycle, to prevent recursive invocation.
[INFO] [resources:resources]
[INFO] Using default encoding to copy filtered resources.
[INFO] [compiler:compile]
[INFO] Nothing to compile - all classes are up to date
[INFO] [clirr:check {execution: default}]
[INFO] Comparing to version: 0.9
[ERROR] org.codehaus.cargo.module.webapp.VendorWebAppDescriptor: In method 'public void addEjb
Reference(java.lang.String, java.lang.String)' the number of arguments has changed
[ERROR] org.codehaus.cargo.module.webapp.orion.OrionWebXml: In method 'public void addEjbRefer
ence(java.lang.String, java.lang.String)' the number of arguments has changed
[ERROR] org.codehaus.cargo.module.webapp.resin.ResinWebXml: In method 'public void addEjbRefer
ence(java.lang.String, java.lang.String)' the number of arguments has changed
[ERROR] org.codehaus.cargo.module.webapp.weblogic.WeblogicXml: In method 'public void addEjbRe
ference(java.lang.String, java.lang.String)' the number of arguments has changed
[ERROR] org.codehaus.cargo.module.webapp.websphere.IbmWebBndXmi: In method 'public void addEjb
Reference(java.lang.String, java.lang.String)' the number of arguments has changed
[INFO] ------------------------------------------------------------------------ [ERROR] BUILD FAILURE
[INFO] ------------------------------------------------------------------------ [INFO] There were 5 errors.
[INFO] ------------------------------------------------------------------------ [INFO] For more information, run Maven with the -e switch
[INFO] ------------------------------------------------------------------------ [INFO] Total time: 17 seconds
[INFO] Finished at: Fri May 25 10:42:45 EDT 2007
[INFO] Final Memory: 22M/127M
[INFO] ------------------------------------------------------------------------
C:\Prototype\Mavenized\Product\cargo>

Status

Assignee

David J. M. Karlsen

Reporter

Kenneth William Colassi

Fix versions

Priority

Major