Uploaded image for project: 'Codehaus Cargo'
  1. Codehaus Cargo
  2. CARGO-186

Testcases testSetConfigDir and testSetHomeDir fail on windows

    Details

    • Type: Bug
    • Status: Closed (View Workflow)
    • Priority: Major
    • Resolution: Fixed
    • Affects Version/s: 0.7
    • Fix Version/s: 0.1-intellijidea
    • Component/s: None
    • Labels:
      None
    • Environment:

      Win XP, jdk 1.4.2

      Description

      junit Testcase: testSetConfigDir took 0,157 sec
      junit FAILED
      junit expected:<...\> but was:<...>
      junit junit.framework.ComparisonFailure: expected:<...\> but was:<...>
      junit at org.codehaus.cargo.intellijidea.CargoConfigurationEditorTest.testSetConfigDir(CargoConfigurationEditorTest.java:93)
      junit

      <SNIPPPP>

      junit Testcase: testSetHomeDir took 0 sec
      junit FAILED
      junit expected:</> but was:<C:\>
      junit junit.framework.ComparisonFailure: expected:</> but was:<C:\>
      junit at org.codehaus.cargo.intellijidea.CargoContainerEditorTest.testSetHomeDir(CargoContainerEditorTest.java:100)
      junit
      junit ERROR Test org.codehaus.cargo.intellijidea.CargoContainerEditorTest FAILED

        Gliffy Diagrams

          Activity

          There are no comments yet on this issue.

            People

            • Assignee:
              hendrikschreiber Hendrik Schreiber
              Reporter:
              arnaudheritier Arnaud Heritier
            • Votes:
              0 Vote for this issue
              Watchers:
              0 Start watching this issue

              Dates

              • Created:
                Updated:
                Resolved: